�@�l��,�@�l�ԍ�,��\��,�X�֔ԍ�,�Z��,�Z������,�F�ؓ�,1�ی��E��ÁE����,2�Љ��,3�܂��Â���,4�ό��U��,5�_�R�����E���R�Ԓn��̐U��,6�w�p�E�����E�|�p�E�X�|�[�c�U��,7���ۑS,8�ЊQ�~��,9�n����S,10�l���i��E���a���i,11���ۋ���,12�j�������Q��,13�q�ǂ�,14���,15�Ȋw,16�o��,17�E�ƁE�ٗp�@��,18����ҕی�,19�c�̉^�c�E�����Ɋւ���A���E�����E����,�芼�ɋL�ڂ��ꂽ�ړI
�����c�������@�l�n��z�l�b�g���[�N,3110005011391 ,���с@��,940-0029,�����s������2����1��10��,,H11.4.16,,,,,,,��,,,,,,,,,,,,,���̖@�l�́A�����s���𒆐S�ɒ��z�n��̐����҂ɑ΂��āA���ۑS�ɂȂ���[���E���H�����Ɋւ��鎖�Ƃ��s���A�z�^�Љ�Â���ɍv�����邱�Ƃ�ړI�Ƃ���B
�����c�������@�l������Âƕ����̗��{�����e�B�A�A����,2110005011392 ,�c�{�@���q,940-2135,�����s�[��2278�Ԓn8,,H11.4.23,��,,,,,,,,,,,,,,,,,,,���̖@�l�́A�����s���y�ю��ӎs�����ɋ��Z����Z���ɑ΂��āA�e��̕����T�[�r�X��񋟂��邱�Ƃɂ���āA�ی��A��Ö��͕����̑��i�Ɋ�^���邱�Ƃ�ړI�Ƃ���B
�����c�������@�l���������F�̉�,8110005012006 ,�R��@���O,940-2112,�����s�哇�{��2����3�Ԓn12,,H12.5.31,��,,,,,,,,,,,,,,,,,,,���̖@�l�́A�A����K�v�Ƃ��鑽���̐l�X�̂��������̂Ȃ������~�����߁A���ݕ}���̐��_�Ɋ�Â������^���𐄐i���A��ÂɌ������Ƃ̂ł��Ȃ����S���L���ȗA���p���t���܂̈���m�ۂɊւ��鎖�Ƃ��s���A�����ĎЉ�S�̗̂��v�̑��i�Ɋ�^���邱�Ƃ�ړI�Ƃ���B
�����c�������@�l�R�{�����i��,3110005012010 ,�ێR�@�q,940-0065,�����s��V�㒬2����1�Ԓn1,,H12.8.31,,,,,,��,,,,,��,,,,,,,,,���̖@�l�́A�R�{�܏\�Z�L�O�قɂ�����A�l�ԎR�{�܏\�Z�̎v�z�Ɛ��U�̑��ՂɊւ����i�A���A���ȁA�֌W�����̓W����ʂ��āA�����̗��j�A���y�A�������A�����O�̕s���葽���̎҂ɏЉ�A�����Ēn��Љ�̔��W�Ɋ�^���邱�Ƃ�ړI�Ƃ���B
�����c�������@�l�V���}�b�N,3110005012019 ,�e�n�@��,940-1151,�����s�O�a1����5��19��,,H13.3.12,��,��,,,,,,,,,,,,,,,,,,���̖@�l�́A�s���̗��ꂩ��A���R�[���A�򕨁A���̑��̈ˑ��ǎ҂̎Љ�A���������A�Ƒ����̑��k���󂯁A�L���Z���̕����̑��i�Ɋ�^���邱�Ƃ�ړI�Ƃ���B
�����c�������@�l���̃X�y�[�X�E�Ȃ�����,6110005012032 ,����@�Ύq,940-1151,�����s�O�a3����8�Ԓn1,,H14.8.21,,,,,,,,,,��,,��,,,,,,,,�{��́A�����̐l���m���̂��߁A������\�͂̍����ڎw���A�����̎����Ɍ��������k�E�x�������y�ь[���������s���ƂƂ��ɁA�j�������Љ�̌`���Ɋ�^����B
�����c�������@�l�h���[��,1110005012037 ,���q�@�q,949-5406,�����s�Y4914�Ԓn1,,H14.11.19,��,,��,,,,��,,��,,,,,,,,,,��,���̖@�l�́A�O���[�v�z�[���̓W�J�ɂ��A�v���҂ł����āA�F�m�ǂ̏�Ԃɂ���҂ɂ��āA�ƒ�I�Ȋ��̉��œ����A�r���A�H�����̉��A���̑��̓��퐶����̋@�\�P�����s�����Ƃɂ��A���p�҂����̗L����\�͂ɉ������������������c�ނ��Ƃ��o����悤�ɂ���B�܂��A�ʏ���쎖�Ɠ��̓W�J�ɂ��A�F�m�ǂ̏�Ԃɂ���҂����łȂ��A�v���҂ł���҂����_�I�ɂ��A�g�̓I�ɂ��Љ�A�o����悤�ɃT�|�[�g����ȂǁA���邭���͂��钷���Љ�̎����Ɋ�^���邱�Ƃ�ړI�Ƃ���B
�����c�������@�l�O���j�b�V��,9110005012038 ,���@�����q,940-0024,�����s���V��2����2��47��,,H14.12.24,,��,,,,,��,,,,,,��,,,,,,,���̖@�l�́A�n��̐X�ѕۑS��n��؍ފ��p�̊�����ʂ��Ēn��̏z�^�Љ�ɍv�����鎖��ړI�Ƃ���B�܂��A�q�ǂ������l�܂ł̕��L���N��w��s���A��ƁA�s���A�����҂ȂǑ��l�ȕ���ɘj��l�X�ɒn���̐X�ѕۑS��n��؍ފ��p�̊����ɎQ�����͂���@���񋟂���B���̗l�Ȋ�����@��񋟂ɂ���Ēn��̐X�ѕۑS��n��؍ފ��p���i�݂Ђ��Ă͒n��������������邱�Ƃɍv������B
�����c�������@�l�Ԃ����ς����i���c��,7110005012064 ,����@�_�i,940-0033,�����s������3����4��1��,,H15.4.25,,,��,,,,,,,,,,��,,,,,,,���̖@�l�́A�ԂƗ΂���Ă邱�Ƃ�ʂ��Đl����ĈȂĂ܂��Â���̐��i��}�邱�ƂŎs������̓I�ɋ������邱�ƂɊ�^���邱�Ƃ�ړI�Ƃ���B
�����c�������@�l�ꕶ�̓m�������,4110005012067 ,��؁@�d��,949-5401,�����s�ѓ�138�Ԓn2,������З�ؑ�����,H15.5.12,,,,,,,��,,,,,,��,,,,,,,���̖@�l�́A���Ɍf���鎖����ړI�Ƃ���B(�P)��������Z���邻�ꂼ��̒n��̗��R�𕑑�Ƃ��A���R�Ƃ̋��������_�ɗ��R�̕����^�����p���I�ɍs���B(�Q)���R�̒��ł̊�����ʂ��A�������S�����N�̌��S�Ȉ琬���������鏔�����𐄐i����B(�R)�V�����̒񏥂���u�V���΂̕S�N����^���v�ɎQ�����A�ϋɓI�ɂ��̈Ӌ`�̌[���ɓw�߂�B(�S)�����e�n�̊��c�̂Ƃ̌𗬁E�A�g���͂��莖�Ƃ�W�J����B
�����c�������@�l�V�������J�E���Z���[����,9110005001767 ,�{�z�@�b��,940-0088,�����s�����P���ڂP�ԂQ�R��,,H15.12.2,,,,,,,��,,,,,,,,,,,,,���̖@�l�́A���J�E���Z���[�̑��ݘA�g��}��Ȃ���A�s���A���Ǝҋy�ю����̂ɑ΂��āA���̕ۑS�Ɋւ���[���E�w�����s���A���R�Ɛl�Ԃ��L���ɋ������A�����\�Ȕ��W��ڎw���Љ���\�z���邽�߂ɕK�v�ȁA��������ۑS�����𐄐i���邱�Ƃ�ړI�Ƃ���B
�����c�������@�l�Ȃ����������������l�b�g�a�d���C�t,4110005012075 ,���@���m�q,940-0022,�����s���V��2����1��14��,,H16.1.30,��,��,��,,,,,,,,,,,,,,,,,���̖@�l�́A����ł����Z�݂Ȃꂽ�X�ŏZ�݂Ȃꂽ�Ƃň��S���ĕ�炵�����邱�Ƃ��ł���悤�ɒ����s�y�ыߗגn��̏Z���Q���̂���������������ʂ��ĉ��E�������K�v�ȍ���҂₻�̉Ƒ��╁�i�̐����Ɏ菕����K�v�Ƃ��Ă���l�����ɁA�������Ɋւ��鎖�Ƃ��s���A�n��Љ�Ɋ�^���邱�Ƃ�ړI�Ƃ���B
�����c�������@�l�a�������l�[,2110005012077 ,�R�c�@��,949-4525,�����s����5551�Ԓn,,H16.3.11,,��,��,,,��,��,,,,,,��,,,��,��,,��,���̖@�l�́A���̒m�V�̐��_�Ɋ�Â��A�n��Z���y�їl�X�Ȑl�������������݂Ȃ���n��Â���Ɋւ���e�펖�Ƃ�W�J���A�n�掑���A�l�I�����̔��@�ƃl�b�g���[�N���A�V���Ȍ𗬂̑n�o�A�n�敗�y�Ɠ`���̕ۑ��p���A�n��̊������y�є_�ѐ��Y���H�Ɠ��̒n��Y�Ƃ̐U�����Ɋ�^���邱�Ƃ�ړI�Ƃ���B
�����c�������@�l�Ȃ������������𗬂˂���,1110005012078 ,�K���@����,940-1154,�����s�{�h2����7��15��,,H16.3.18,,,��,,,,,,,,,,,��,,��,,,��,���̖@�l�́A�����n��̏Z���y�ъe��c�̂ɑ΂��āA�����E�����ɖ��������n����̗��ʂ̑��i�A�Z���𗬁A�e��n��R�~���j�e�B�̎x���y�ђn�掑���̔��@�A�琬�A���p���Ɋւ��鎖�Ƃ��s���A��񉻎���ɑΉ������L���Ȓn��Љ�̎����Ɋ�^���邱�Ƃ�ړI�Ƃ���B
�����c�������@�l�Z�����S�l�b�g���[�N�W���p��,2110005012085 ,���؁@�m,940-0087,�����s���3����2��25��,,H16.7.9,��,,��,,,,��,,��,,,,,��,,,��,,,���̖@�l�́A�n��Z���̐g�̉��ŋN�����ƍߏ��A�ЊQ���A�p�j�V�l���ȂǁA�s���@�ւ�����W������̂ق��ɁA�ٗp�@��̊g�[��}����╟���̑��i��}����ȂǁA�L���n��Z���ɂƂ��ėL�v�ƂȂ���𗘗p�҂ł���Z���̌g�ѓd�b��p�\�R���֔z�M���邱�Ƃɂ���āA�Z�������S�Ɉ��S���Đ����ł���Z�݂悢�X�Â���Ɋ�^���܂��B
�����c�������@�l�����W���j�A���[�X�t�b�g�{�[���N���u,1110005012086 ,���c�@���F,940-0033,�����s������1����3��25��,,H16.8.19,,,,,,��,,,,,,,��,,,,,,��,���̖@�l�́A��ɐ��N�ɑ΂��ăT�b�J�[�X�N�[���y�уT�b�J�[�����^�c����Ƌ��ɁA�T�b�J�[�w���҂̔h�������s���A�X�|�[�c��ʂ��Č��S�ȐS�g�̈琬�ɓw�߁A�n��X�|�[�c�̐U���Ɋ�^���邱�Ƃ�ړI�Ƃ���B
�����c�������@�l�V�����R�쑐�������˂��E�A��������,9110005012087 ,�������@�F,940-1146,�����s����1406�Ԓn6,,H16.10.12,,��,��,,,,��,,,,,,��,,,,,,��,���̖@�l�́A���R�Ɛl�Ԃ��L���ɋ������A�����������ɓ`������Ƌ��Ɍ��N�ŐS�L���ȏ����̂��鐶���Ǝ����\�ȎЉ���\�z���邽�߁A����A�s���A�^�������Ɠ��Ƃ̑��ݘA�g��}��Ȃ��炠������ۑS�����Ƃ��̂��ƐS����ދ���𐄐i���邱�Ƃ�ړI�Ƃ���B
�����c�������@�l�ɂ������G�W�\���w��,7110005012089 ,�����@�L,940-1105,�����s�ۓc��2����4��28��,,H17.1.28,,��,,,,,,,,,,,��,,��,,,,,���̖@�l�͎Љ�̉Ȋw�Z�p�Ɋւ���֐S�̒ቺ����N�̗����n����ɑΉ����邽�߁A�Ȋw�Z�p�y�ю��R�Ȋw���{�������Ă���y�����A�f���炵����`���A��̓I�ɋ��������Ă�悤�ȋ@���x�����Ƃ�񋟂���B����ɁA�����̎��Ƃ�ʂ��Ēn��Љ�̔��W����N�̌��S�琬�A�����N�̐��������n�o�Ɋ�^���邱�Ƃ�ړI�Ƃ���B
�����c�������@�l���Ȃ�����,1110005012094 ,���q�@�q,949-5411,�����s���}��2390�Ԓn,,H17.3.16,��,,��,,,,��,,,,,,,,,,,,��,���̖@�l�́A���݋Ǝ҂ً̈Ǝ�𗬂�}��A�V����i�o�֎��ƓW�J��ڎw���A�n��ɂ�����o�ϋy�ьٗp�̓_�ő傫�ȐӔC�����o���A�����̊Ǘ��^�c�A���H�A�͐�A�s�@�������̊��p�g���[���A�n��̉Ԃ����ς����������ɂ����ۑS��}��A�n��Z�������S���ĕ邹�钬�Â���A�n��Â�����Z���͊���s���Ƃ̘A�g��}��A��ϑ����Ƃ�ϋɓI�Ɏ�����邱�Ƃɂ��V�K�ٗp�A����ҁA��Q�҂��̑��̐l�ލ̗p��i�߂鎖��ړI�Ƃ���B����ɁA����Љ�X���ɂ����āA�F�m�ǑΉ��^�{�݂̃O���[�v�z�[���ݗ����͂��߁A�Z����C�̃o���A�t���[���A����Ҍ����W���Z��̉�쎖�ƁA����ҁA��Q�ғ��̃P�A�A���T�[�r�X���Ƃ̊����ɂ��A����҂��Q�҂̂��߂ɁA���퐶���Ɋ|����o��S�̌y���ƈ��S��񋟂��A�n�敟���ɍv�����čs������ړI�Ƃ���B
�����c�������@�l�ăj�P�[�V�����Z���^�[,1110005012235 ,���΁@�ߎq,954-0181,�����s�e��V�c�����O��970�Ԓn99,,H17.5.19,,,,,,,��,��,,,,,,,,,,,,���̖@�l�́A�V�����𒆐S�ɔ_�Ɛ��Y�ɏ]������҂Ə���ҁA�y�сA�֘A�Ǝ҂ɑ΂��āA���ۑS�ɂȂ���z�^�_�ƁE�@�\���i��̕��y�̌[�������A���̕ۑS�A���тɁA�č������A�y�сA�ЊQ���̐t�����͊��ғ��ւ̐H�Ǝx���Ɋւ��鎖�Ƃ��s���A�z�^�Љ�`���ƍЊQ���̎x���ɍv�����邱�Ƃ�ړI�Ƃ���B
�����c�������@�l�q��čL��ӂ�����,9110005012285 ,���X�؁@�M�a,940-0136,�����s�����u2��33��,,H17.9.30,��,,,,,,,,,,,,��,,,,,,,���̖@�l�́A�q��Ē��̐e��������s����ǓƊ����������邽�߂̊��Â���Ȃǂ̎q��Ďx�����Ƃ�ʂ��āA�e�B�����S���Ă��������Ǝq��Ă��ł������S���q�ǂ����������₩�Ɉ�n��Љ�����邱�Ƃ�ړI�Ƃ���B�܂��A�n��Z���̎x�������d�g�݂����A�n��R�~���j�e�B�̊��������߂������̂Ƃ���B
�����c�������@�l�΂��邨���Ȕ�����މ�,8110005012286 ,���с@����,940-0223,�����s�Ȕ��{��11��8��,,H17.10.20,��,��,��,,,��,��,,��,,��,,��,,,,��,,,���̖@�l�́A�Ȕ��n��̏Z����Ȕ��n���K���l�ɑ΂��āA��؂��͂��ߐፑ�Ɠ��̕����������̒n��̌i�ς␶�����A�����C���t����ǍD�Ȃ��̂ɂ��鎖�Ƃ��s���A�q�ǂ����獂��҂܂ň��S���ĕ�炷���Ƃ��ł��A���͂���₳�����X�Â���Ɋ�^���邱�Ƃ�ړI�Ƃ���B
�����c�������@�l�����̒��ۓc�����������̉�,5110005012248 ,�n糁@����,940-1105,�����s�ۓc��4����8��12��,,H17.12.8,,,��,,,,,,,,,,,,,,,,,���̖@�l�́A�����s�ۓc���n��𒆐S�Ƃ����\�������݂̋��͂Ǝ����̑��݊��p��ʂ��āA���Â����n�您�����̎��Ƃ��s���A���L�őn���I�Ȋ��͂���n��Љ�Â���Ɋ�^���邱�Ƃ�ړI�Ƃ���B
�����c�������@�l�V�����o�όٗp��茤����,2110005012242 ,���c�@�鎡,940-2033,�����s�㏜��1993�Ԓn18,,H17.12.22,,��,��,,,,,,,,,,,,,��,��,,��,���̖@�l�́A�V�����̌o�όٗp���ɂ�����s�s��肨��ђn��o�ϊ������ɂ��Ē��������Ƃ��̌��\���s���A�u���E���M�E�@�֎������Ȃǂ̌[�֊�����N�Ǝx���E�ٗp�n�o�x���E�o�c�x���Ȃǒn��o�ϊ������x�����Ƃ��s�����Ƃɂ����v�Ɋ�^���邱�Ƃ�ړI�Ƃ���B
NPO�@�l�t�H�[�����Ȕ��M�s�i�l�b�g�j,8110005012484 ,�k���@��,940-0224,�����s����3��18��,,H18.2.21,,,��,,,,,,,,,,,,,��,,,,���̖@�l�́A�s���A�y�ђn��Љ�A���C�ɖ��̂��鐶����ڎw���A����������炷�ׁA���Â��萄�i�Ǝx���Ɋւ��鎖�Ƃ��s���Ƌ��ɏZ���A�s���A��Ƃ̃p�[�g�i�[�V�b�v�ɂ��n��Љ�Â���Ɋ�^���邱�Ƃ�ړI�Ƃ���B
�����c�������@�l���n�E�X���₫�̉�,7110005012485 ,�I���@��,940-2015,�����s�]�z1����15��22��,,H18.2.27,��,��,,,,,,,,,,,��,,,,,,��,���̖@�l�́A�����s���y�ю��ӎs�����ɋ��Z�����Q�҂��A�[�����������𑗂邱�Ƃ��ł���悤�ɕ�����Ə��̉^�c�������̒��S�Ƃ��ď�Q�҂̎����ƎЉ�Q���𐄐i���A�����Ēn��Љ�̕������i�Ɋ�^���邱�Ƃ�ړI�Ƃ���B
�����c�������@�l�z�̗��R��y��,4110005012496 ,���V�@��,940-2042,�����s�{�{��1����468�Ԓn1,,H18.5.1,��,��,��,,,��,��,,,,,,��,��,��,,��,,��,���̖@�l�́A�ፑ�̗��R�̖]�܂����p���l���A�l�Ɨ��R�Ƃ̗ǂ��֌W�����߂����߁A���R�ɂ����鎩�R������j�����A�`�������A�Z�p�A�����T��A������݂̋��͂�L�͂Ȑl�X�Ƃ̋��������ƂɁA���R���̂̎��R���ۑS������P�A�����\�Ȓn��Љ�Â���Ɋ�^���邱�Ƃ�ړI�Ƃ���B
�����c�������@�l�l�b�g���[�N�E�t�F�j�b�N�X,1110005012499 ,�y�c�@����,940-0062,�����s����1����5�Ԓn9,���b�cCR�r��,H18.6.12,,,��,��,��,��,,,,,,,��,,,��,,,��,���̖@�l�͐V�������z��k�ЂȂǂ̎��R�ЊQ�ɂ��r��Ȕ�Q�ɑ��������n��y�яZ���̂��߂ɁA�������x������l�X�Ȋ������s���A�l�b�g���[�N�����A�S���֌����ē`���邱�Ƃɂ���ĐV�����S�̂̌o�ς����C�t�����������A�ό��Y�Ƃ����ɂ��āA�V�����u�����h�̑n�݂�}��A�n��o�ς̔��W�ɗ��悵�čv�����鎖��ړI�Ƃ���B
�����c�������@�l���z�h�Ѓt�����e�B�A,9110005012500 ,�c���@�m,947-0205,�����s�R�Îu���T3373�Ԓn1,,H18.8.23,��,��,��,,,,��,��,��,,��,,��,��,,��,��,,��,�{��́A���z�n�擙�ɂ������Вn�Z���̐����Č����A�������Ƃ�ʂ��Ďx������ƂƂ��ɁA���̉ߒ��ɂ����ē����m���E�o�����A�n��̑����I�Ȗh�З͂̌���Ɏ����邱�Ƃ�ړI�Ƃ���B
�����c�������@�l�n�����N���u����,4110005012505 ,�N��@�J�c�G,940-0831,�����s���107�Ԓn2,,H18.9.5,,,,,,,��,,,,,,,,,,,,��,���̖@�l�́A�n��̉ƒ�A���Ə�����r�o���ꂽ�p����������A���T�C�N�����鎖�Ƃ��s�����ƂŒn�����̕ۑS�Ɋ�^���邱�Ƃ�ړI�Ƃ���B
�����c�������@�l�q�ǂ��̋s�Җh�~�l�b�g�E�ɂ�����,9110005012509 ,���ԁ@�^�R��,940-0071,�����s�\��4����1�Ԓn3,����Ԉ�@���,H18.11.1,��,,,,,,,,,��,,,��,,,,,,,���̖@�l�́A�q�ǂ��ɑ΂���s�҂̖h�~��}��A�ȂāA�q�ǂ��ƉƑ��̕����̌���ƎЉ�S�̗̂��v�̑��i�Ɋ�^���邱�Ƃ�ړI�Ƃ���B
NPO�@�l�Ǌ��̗�������������,8110005012518 ,�l�c�@��,940-2402,�����s�^���厚�^��386�Ԓn,,H19.1.24,,��,��,,,��,,,,,,,��,,,��,,,,���̌�����́A�Ǌ�����̈⓿���w�сA�n��̕����@���@��N�����A����ɂӂꍇ���[�������Ȃǂ�ʂ��Đl�ƕ��Ƃ̌𗬂𑣂��n��̊�������}�邱�Ƃ�ړI�@�Ƃ���B�����āA���̎g���́A�Ǌ������̎j�Փ��̕ہ@���E�p���E�����ɓw�߁A�Ǌ������̏�񔭐M�ɖ��߂邱�ƂŗǊ��䂩��̒n�您�����ɍv�����邱�Ƃł���B
�����c�������@�l�����Z�p������,9110005012525 ,����@�T��,940-0085,�����s������3����5��25��,,H19.2.26,,,,,,��,��,,,,��,,,,��,,,,,���̖@�l�́A�����Ɋ֌W����������l���A����Љ�̐����̂���ׂ��p��`���o���A�����Đ����̗L�����p����ۑS�A�h�Њ�Ր����̐��i�Ɋ�^���邱�Ƃ�ړI�Ƃ���B�{�@�l�����̎傽��Ώےn��Ƃ��ẮA�k���n���ƒ������k�n�����͂��߂Ƃ�����{�C��Ƃ��A���̓���������Ԃ�T�����A��������`�����Ƃ�����̂ł���B
�����c�������@�l�悵���[�R�Îu,9110005012541 ,�܏\���@�ǈ�,940-0824,�����s����4����858�Ԓn230,,H19.5.22,,��,��,,,��,��,��,��,,��,,��,��,,��,��,��,��,���̖@�l�́A�V���������s�R�Îu�y�т��̎��Ӓn��̒��z��k�Ђ���̕����x���Ƃ��̌�̏��ۑ��n��Z���ƂƂ��ɉ������A�n�抈�����Ɋ�^���邱�Ƃ�ړI�Ƃ���B
�����c�������@�l�����m,8110005012542 ,�{�c�@�_��,940-0213,�����s�Ȕ��R�c��1��10��,,H19.6.25,,,��,,,��,��,,��,,,,,,,,,,,���̖@�l�́A�L���n��Z���ɑ΂��A���̎��Ƃ��s�����Ƃɂ��A�n��̎������̑��i�A�n��̔��W�A�����̗��v�Ɋ�^���邱�Ƃ�ړI�Ƃ���B�i�P�j�n��o�ρA�n�敶���y�ђn��X�|�[�c�̔��W�ׂ̈̎x�������i�Q�j�n�����Y�i�̊��J���y�є̔��̎x�������i�R�j�l�ވ琬���тɒn�斯�ւ̍u����̊��^�c
�����c�������@�l�܂��Ȃ��l�[,5110005012545 ,����@���v,940-0065,�����s��V�㒬2����3�Ԓn5,,H19.10.22,,��,��,,,,,,��,,,,,,,,,,,���̖@�l�́A����𒴂����s���̌𗬂̏��n�����A���܂��܂ȏW����A���̔��M����ʂ��āA�ǍD�Ȏs�X�n�̌`����}��A�ȂāA�܂��̂ɂ��킢�̍Đ��A���S�s�X�n�̊������Ɋ�^���邱�Ƃ�ړI�Ƃ���B
�����c�������@�l�b�T�|�[�g,4110005012546 ,�����@����,940-2311,�����s�O���V��3077�Ԓn2,,H19.11.1,��,,,,,,,,,,,,,,,,,,,���̖@�l�́A��Q�ґ����x���@�Ɋ�Â��A�s���葽���̏�Q���x�����ȏ�̏�Q�҂ɑ΂��āA������A�s�����쓙�̕����T�[�r�X�Ɋւ��鎖�Ƃ��s���A��Q�҂̒n��Љ�Q���Ɋ�^���邱�Ƃ�ړI�Ƃ���B�܂��A���̖@�l�́A���������@�Ɋ�Â��A��Q���ɑ΂��A��Q���ʏ��x�����Ƃ��s���A��Q���̎����𑣐i����x�����s�����Ƃ�ړI�Ƃ���B�Q���̖@�l�́A���l�ȎЉ�����L�@�I�ɘA�g�E�������Đl�ƒn����J����蒼���A���݂����x���������C�̂���n��Љ�̍Đ���ڎw���A���ł��ǂ��ł����̐l���Ί�ł�����悤�ɁA�l�Ƃ̊ւ�荇�����؂ɂ��Ȃ���A�����炵����炷���Ƃ̂ł��鋏�ꏊ�Â���̂���`�����s�����Ƃ�ړI�Ƃ���B�܂��A�e�n��ɂ����ĕ��G���l�����镟���Ɋւ��鏔�X�̉ۑ�ɂ��đ����I�ɑ��k�y�юx�����ł�����̐l�ނ��琬���邱�Ƃ�ړI�Ƃ���B
�����c�������@�l���̉�,8110005012550 ,�]��@����,954-0124,�����s���V��834�Ԓn7,,H20.2.12,��,��,��,��,,,,,,,��,,��,,,,��,,,���̖@�l�́A��Q�ҋy�т��̉Ƒ��E�֌W�҂ƂƂ��ɕ���������ʂ��ĎЉ��������ł���悤�A�����퐶���̎w����x�����s���ƂƂ��ɏ�Q�҂��n��Љ�̒��łƂ��ɕ�点��悤�x�����A�����̑��i�Ɋ�^���邱�Ƃ�ړI�Ƃ���B
�����c�������@�lMTN�T�|�[�g,1110005013027 ,���@��,949-5213,�����s�������@��676�Ԓn,�X�y�[�X���r��3�K,H20.3.14,,,��,��,��,,��,,,,,,��,,,��,,,,���̖@�l�́A�n��ɂ�����_�ѐ��Y�Ƃ̎��ԂƓy�n���p�̒����E�������s���A�����Ɍ������΍�𗧈Ă��A�L���s���ɑ΂��āA�񌾁E�[�ցE�L��E�����ъ������s�����Ƃ�ړI�Ƃ���B����Ɏ������S���q���������n��̖��͂��l���A�w�Ԃ��Ƃ𑤖ʓI�Ɏx�����A�l�Ǝ��R���D��Ȃ��₷�炬�̌𗬒n������邱�Ƃ�ړI�Ƃ���B
�����c�������@�l�����Y�Ɗ���������m�`�y�d,6110005013047 ,�R�݁@���],940-2127,�����s�V�Y4����1�Ԓn9,,H21.3.11,,,,,,,,,,,,,,,��,��,��,,,���̖@�l�́A��ɒ����n��̐����Ƃ��͂��߂Ƃ���Y�ƊE�A��w���A���H�c�́A�Y�Ǝx���@�ցA�n����Z�@�ցA�s�����тɁA�����n��̎Y�ƐU���ɐϋɓI�Ɏ��g�ގ҂��L�@�I���Z���ɘA�g���āA�V�Z�p�̊J���y�ѐV���Ƃ����X�Ɛ��ݏo���g���m�Â���̋��_�n��h���`�����邱�Ƃɂ���Ē����n��̊������Ɋ�^���邱�Ƃ�ړI����B
�����c�������@�l������l�b�g���[�N,8110005013045 ,�����@���Y,940-0884,�����s�T�L��1719�Ԓn1,,H21.3.23,��,��,,,,,,,,,,,,,,,,,��,���̖@�l�́A�L������҂�ΏۂƂ��āA�F�m�ǑΉ��^�����������A�Z�������������A�K����A�ʏ���쓙�̉��ی��@�Ɋ�Â��ݑ���T�[�r�X���Ƃ���{�����e�B�A�Љ�Ȃǂ̎x�����Ƃ��s�����ƂŁA����҂��n��Љ�̒��Ŏ������������������Љ�̎����Ɋ�^���邱�Ƃ�ړI�Ƃ���B
�����c�������@�l�W���[���l�X�N�W���p��,1110005013051 ,���с@�B�Y,949-5401,�����s�ѓ�138�Ԓn2,,H21.4.27,,��,��,,,��,,,,,��,,��,,,,,,,���̖@�l�́A���R�Ƌ��������ꕶ�����̒m�b�ƃG�i�W�[���w�ѓ`���A���������̐����Ɋ��������Ƃɂ��A�L���ȕ����̔��W�Ɛ��N�̌��S�琬�Ɏ����邱�Ƃ�ړI�Ƃ���B
�����c�������@�l�V���̏Z�܂����l�����,2110005013059 ,�勴�@���b,940-2402,�����s�^���^��1086�Ԓn,,H21.11.18,��,,,,,,��,,��,,,,��,,,,,��,��,���̖@�l�́A�V�����ɍݏZ�����ʎs������ь��z�E�c�U�Ɍg���Ǝ҂ɑ΂��āA���A�q��āA����A�ߑa���A�y�b�g�����ȂǗl�X�ȃ��C�t�X�^�C���ł̏Z�܂��݂̍����ϐk�E�h�ƁE�f�M�E�ȃG�l���M�[�E�V�b�N�n�E�X�΍�Ȃǂ̌��N�ň��S�ȏZ�܂��݂̍����V�����̋C�󕗓y�𓥂܂��Z��̌��z�E�ێ��E���C��ĂɊւ����{�m������̒񋟁E�c�U�ێ�̎w�����s���A�����ďZ�܂��̑��k�E�����A��ċy�ѓK���ȉ��i���f�A�����ȋƎҁE���ށE���i�̈������Ƃ��s�����ƂŁA�Ǝ҂̎�������ƐV�����ɍݏZ�����ʎs�������S�����S�ɕ�点��Z���̍\�z�Ɋ�^���邱�Ƃ�ړI�Ƃ���B
�����c�������@�l�������������i���c��,3110005013074 ,���@��I,940-0824,�����s����4����858�Ԓn296,,H22.6.11,��,,��,,,��,��,,��,,,,��,,,��,,,��,���̖@�l�́A�n��̏Z���y�ъe��c�̂ɑ΂��āA�ߑa�n�̗l�X�Ȑ��𐶂������A�n�抈�����̐��i�����ŁA���S���S�ȎЉ�̍\�z�A�����̒n��R�~���j�e�B�S�̗̂��v�̑��i�Ɋ�^���邱�Ƃ�ړI�Ƃ���B
�����c�������@�l������𗬊قɂȃj�[�i,2110005013075 ,���|�@���q,940-0875,�����s�V��1����11��22��,,H22.7.7,��,��,��,,,,��,��,��,,��,��,��,,,��,��,,��,���̖@�l�́A�q��Đ���𒆐S�ɑ�����E�������E������E���n��̌𗬂����I�ɂł���ꏊ�Ƌ@��̒񋟂����邱�Ƃɂ�āA�u�l�Ƃ̋��́E�ւ��v���؂ɁA���݂�����ݍ�����Љ���߂������Ƃ�ړI�Ƃ���B
�����c�������@�l�ɂ���������݂�Ȃ�������,8110005013078 ,���V�@�N��,949-7504,�����s�����1979�Ԓn344,,H22.7.30,,,��,,,,,,,,,,,,,,,,,���̖@�l�́A���z��k�Ђ̐k���n�ł��鋌������̂��钆�z�n��𒆐S�Ƃ����\�������݂����͂��A�n��̓��F�����������k�Ђ���̕����ƁA�����֘A�{�݂����p�����n��U���Ɍq���鎖�Ƃ��s���A����������琶�܂ꂽ�����̓����e�n�ւƌq���Ă����A�e�n�Ƃ̘A�g�������Đk�Е����̌`���������n�k�T�~�b�g���J�Â��A�n�k�΍���v�Ă���񔭐M���Ă����ƂƂ��ɁA��������̍X�Ȃ锭�W�������������Ƃ�ړI�Ƃ���B
�����c�������@�l�֌����R�E�ʂ���܉�,1110005013092 ,�z��@����,940-2039,�����s�֌���3����4782�Ԓn,,H23.4.22,,��,��,,,,��,,,,,,��,,,,,,��,���̖@�l�́A�ɂ������u�΁v�̕S�N����\�؂�A���錧���^���̎�|�Ɏ^�����A��ɒ����s�����u�˓��n���т�Ώۂɓy�n�{���̐A���ɂ��X�Â���𐄐i����B�܂��A���R�̐A���A���Ԍn�Ɋw�ѐ��N�̌��S�琬�A�n�斯�̐e�r��}�邱�Ƃ�ړI�Ƃ���B
�����c�������@�l�t�m�d,2110005013091 ,�ƘV�@�m,940-0242,�����s��V�L869�Ԓn,,H23.4.22,��,��,��,,��,,��,,,,,,��,,,,��,,,���̖@�l�́A�_���|��ƂȂǂ�ʂ��A�����s�y�ю��ӍݏZ�̏�Q�ҁA����҂��l�Ԃ炵���A�ւ�������Ď������Đ������邱�Ƃ��x�����A�ꐶ���S���ĕ�点��Љ�̍\�z��ڎw���Ƌ��ɁA���̎Љ�̊�������}�邱�Ƃ�ړI�Ƃ���B
�����c�������@�l���炵�T�|�[�g�z����,4110005013932 ,�����@�D,949-7503,�����s������R1441�Ԓn,,H23.12.26,��,��,��,,,��,��,��,��,,,��,��,,,��,��,,��,���̖@�l�́A�n��Z�����݂��Ɏx�������A�N�������S���ĕ�点��A���C����n��Љ�����邽�߁A������ʂ��Ăӂ邳�Ƃ̊������𑣂��A�Z�݂悢�n��Љ�Â���Ɋ�^���邱�Ƃ�ړI�Ƃ���B
�����c�������@�l��]�̉����,3110005014741 ,�X�c�@���q,940-0034,�����s���Z2����4��44��,,H24.2.28,��,,,,,,,,,,,,,,,,,,��,���̖@�l�́A���_��Q�ҋy�т��̉Ƒ��̕����̌���Ɛ��_��Q�҂̎Љ�Q���̑��i��}�邱�Ƃ�ړI�Ƃ���B
�����c�������@�l�s�������l�b�g���[�N����,5110005014748 ,�H��@�F�M,940-2126,�����s���Ò�3785�Ԓn16,,H24.3.5,��,��,��,��,��,��,��,��,��,��,��,��,��,��,��,��,��,��,��,���̖@�l�́A�s����l�ЂƂ肪�����̂܂��Â���̎����S���A���݂����x�������A�Ȃ��荇���u�Ί炢�������E�����̂܂������v�̎����Ɋ�^���邱�Ƃ�ړI�Ƃ���B
�����c�������@�l�v���W�F�N�g�W�W,8110005014885 ,�����@�ؗ�,954-0181,�����s�e��V�c�����O��970�Ԓn294,,H24.4.5,,��,��,,,,,,,,,,��,,,��,,,��,���̖@�l�́A��҂�w���A�n��Љ�ɑ΂��āA�H�ւ̊֐S�������A���̔_�ƁA�H���������̌���̃��`�x�[�V���������߂銈����A��w�E��w�@�A����A���w�Z���̋���@�ւ̌����A�����A���C�E���K���̐��ʂ������č��̐H�̔��W�ɍL���Љ�ɑ΂��Č[�����y�A�����āA���{�̐H�𐢊E�ɒm�炵�߂邱�ƂɊ�^���邱�Ƃ�ړI�Ƃ���B
�����c�������@�l�V���X�|�[�c�A�N�g,4110005014930 ,�����@���u,949-5412,�����s����677�Ԓn1,,H24.6.6,,,,,,��,,,,,,,��,,,,,,��,���̖@�l�́A�e��X�|�[�c�����y�уX�|�[�c�N���u�̊��E�^�c�Ɋւ��鎖�ƁA�X�|�[�c�w���҂̈琬�Ɋւ��鎖�ƁA�X�|�[�c�ɂ��ẴC�x���g�E�u����̊��E�J�ÂɊւ��鎖�ƁA�e��X�|�[�c�֘A�c�̓��Ƃ̋��́E�x���Ɋւ��鎖�Ɠ����s�����ƂŁA�X�|�[�c�̐U���Ǝq�ǂ��̌��S�琬��}��A�L�����v�Ɋ�^���邱�Ƃ�ړI�Ƃ���B
�����c�������@�l�a�����C�t�E�P�A����,5110005014970 ,����@���O,949-4525,�����s����4657�Ԓn1,,H24.10.9,��,,��,,��,,��,,,,,,,,,,,,,���̖@�l�́A���悢�n��Љ��ڎw����c���g�D�Ƃ��āA�u�Ƃ��ɐ����邭�炵���߂����āv�̗��O�̂��ƁA�����n��̈ړ�����҂ɑ΂��āA�O�o�ړ��x���Ɋւ��鎖�Ɠ���ʂ��āA�S�̂������������x���T�[�r�X��񋟂��邱�Ƃɂ�镟���̂܂��Â���A�y�юR�т̕ۑS���s�����ƂŎ��R�����������������ɂ₳�����܂��Â���̐��i�Ɋ�^���邱�Ƃ�ړI�Ƃ���B
�����c�������@�l�Ȃ���h�ЋZ�p�t�H�[����,6110005014978 ,�����@����,940-0098,�����s�M�Z2����6�Ԓn1��,�G�[�����r���f�B���O301,H24.10.19,,,,,,��,��,,��,,��,,,,��,,,,,���̖@�l�́A�ፑ�̏Z���Ȃ�тɒn��ɑ΂��āA����܂ł̂Ȃ���h�Вm���𐮔����A�ł����ʓI�ȂȂ���ЊQ�̖h�Б΍�Z�p��񋟂��邱�ƂŁA�Ȃ���ЊQ�΍�̎��{�𑣐i���A�n��h�З͂̌���Ɋ�^���邱�Ƃ�ړI�Ƃ���B
�����c�������@�l�s���A�́[��,2110005014981 ,���V�@���l�Y,940-2145,�����s�t��4����9�Ԓn7,,H24.11.2,��,��,,,,��,,,,��,,,��,,,,��,,��,���̖@�l�́A���B�Ⴊ�����E�҂���т��̑��̏Ⴊ�����E�҂Ƃ��̉Ƒ��A�֌W�ҋy�ђn��Љ�ɑ΂��āA�K�؂ȗÈ�A�������m���̌[���A�K���ȎЉ���̏�̒񋟂���ђn�搶�����x�����鎖�Ɠ����s���A�����Ĕ��B�Ⴊ�����E�҂̂��悢�����A�K���Ȑl���̑n���ɍv������ƂƂ��ɎЉ���S�̗̂��v�̑��i�Ɋ�^���邱�Ƃ�ړI�Ƃ���B
�����c�������@�l�L�Y�i�̐X,1110005015270 ,�R�c�@�~��,954-0124,�����s���V��545�Ԓn2,,H25.4.23,��,��,��,��,��,��,��,��,��,,,,��,,,��,��,,��,���̖@�l�́A�n��̎������������h�Јӎ������߃L�Y�i��[�߂�d�g�݂Â���ƁA�l���W���𗬂̏��n�����A�Z�����݂��Ɏx�����������̂܂��Â����S���A�u�n��͂̌���v�̎����Ɋ�^���邱�Ƃ�ړI�Ƃ���B
�����c�������@�l���N���S�琬��,2110005015542 ,�B��@�F,940-0897,�����s�V�g��4821�Ԓn2,�X�v�����h�D�[��B2,H26.3.10,,��,,,,,,,,,,,��,,,,,,��,���̖@�l�́A���N�y�т��̕ی�҂ɑ΂��āA���N�̌��S�琬�Ɋւ�錤�C����񋟓���ʂ����[�����Ƃ��s���ƂƂ��ɁA����@�ւƂ̘A�g��}��A�K�v�Ȏ��Ƃ����{���邱�Ƃ������āA���N�̌��S�琬�܂��͎Љ��̌���Ɋ�^���邱�Ƃ�ړI�Ƃ���B
�����c�������@�l�V�����C���h���C�t���T�[�`,9110005015602 ,�R�{�@����,940-0864,�����s���4����253�Ԓn5,,H26.5.13,,��,,,��,,��,,,,,,��,,��,��,��,,��,���̖@�l�́A�V�������тɋߗ׊e���ɂ�����쐶���b�̕ی�Ǘ��y�є_�ѐ��Y�Ɣ�Q�h���Ɋւ��鎖�Ƌy�ђ����A���瓙���s���A�쐶���b�Ɛl�Ԃ̋����A�y�т����ʂ��Ď��R���̕ۑS�Ɋ�^���邱�Ƃ�ړI�Ƃ���B
�����c�������@�l�Ȃ����������n���l�b�g���[�N,6110005015605 ,�R��@�Ύ�,940-0062,�����s����1����4�Ԓn10,,H26.5.26,,,��,��,,��,,,,,,,,,,��,,,��,���̖@�l�́A�V�e�B�z�[���v���U�A�I�[�������𒆐S�ɁA�s�������ɂ�銈�͂̂���܂��Â���̐��i�Ɋ�^���邱�Ƃ�ړI�Ƃ���B
�����c�������@�l�S��铂��������m,9110005015610 ,�Ð�@����,954-0123,�����s���V��736�Ԓn9,,H26.5.26,��,��,��,,��,,��,,,,,,��,,,,,��,��,���̖@�l�́A�L���s���ɑ΂��āA���{�̖L���Ȏ��R���ƐH�����𐶂����󂯌p���H��̐��i�A�_�Ƃ̎����I�Ȕ��W�A�S�g�̌��N�̈ێ����i�ȂǂɊւ��鎖�Ƃ��s���A�ȂĎЉ���̌���Ɋ�^���邱�Ƃ�ړI�Ƃ���B
NPO�@�l�Ƃ��̖�,5110005015655 ,���c�@��h,940-0214,�����s�Ȕ��R�c��4��5��,,H26.9.17,��,,,,,,,,��,,,,,,,,��,,,���̖@�l�́A�Ⴊ���҂̓��퐶���y�юЉ������ׁ̈A�Љ�Q���Ɍ������Z�p�̏K���⎩���ӎ��̌���̎x�����s�����Ƃɂ��A�Ⴊ���̗L���Ɋւ�炸�����ł���L���ȎЉ���Â���ƈ��S���S�ȎЉ�̍\�z�Ɋ�^���邱�Ƃ�ړI�Ƃ���B
�����c�������@�l���܂���炢�ӃT�|�[�g,1110005015683 ,�א�@����,940-0071,�����s�\��3����1��9��-2,,H26.11.28,��,��,��,,,,��,,,,,,,,,,,,��,���̖@�l�́A����ҁA�Ꮚ���ҁA�q��Đ���A��ҁi�w���j�A�󂫉Ƃ̏��L�ҋy�ыߗ׏Z���ɑ΂��āA�󂫉Ƃ�Z��Ɋւ��鑊�k���󂯂��̖��ɑ΂��Ċ���Ă��s���A�s�X�n�̊������Ɋ�^���邱�Ƃ�ړI�Ƃ���B
�����c�������@�l�w�уX�y�[�X������̐X,2110005015724 ,�R�c�@�|�h,940-0026,�����s�Γ�2����3��9��,,H27.3.5,,,,,,,,,,,,��,��,,,,,,,���̖@�l�́A���炩�̗��R�ň��S���Ċw�Z�֒ʊw���邱�Ƃ�����Ȏ������k��A���e�̋������ɂ����ی�̋��ꏊ���K�v�Ȏ������k�ȂǁA���ׂĂ̎������k�ɑ΂��āA���ꏊ�̒񋟁A�w�K�x���A���̑�����Ɋւ��鎖�Ƃ��s���A�������k�̌��S�Ȑ����A�ی�҂̎q��Ďx���Ɋ�^���邱�Ƃ�ړI�Ƃ���B
�����c�������@�l�ӂ邳�Ɩ����n����,4110005015722 ,�V�c�@��_,940-0034,�����s���Z3����4��39��,,H27.3.5,,��,��,,,��,��,��,��,,,,��,,,,,,,���̖@�l�́A�V�����̋���y�іh�Њ֌W�҂𒆐S�Ƃ����\�������݂̋��͂Ǝ����̑��݊��p��ʂ��āA���܂������n���m��A�̋��ւ̐[�����y���ƍЊQ���琶�������͂���݁A�����Ď������g�̐��������l����w�K�@��Ƃ��āA�w�Z����̂Ƃ������Ɩh�ЂɊւ��鋳��̐��i���������鎖�Ƃ��s���A���R�Ƌ�������l�Â���̂��߂ɁA�w�Z�A�n��A�ƒ낪�����荇���A�q�ǂ����������炷��n���тł̋���Љ�̎����ɍv�����邱�Ƃ�ړI�Ƃ���B
�����c�������@�l�l�[��������,1110005015733 ,�ߓ��@�o�u�Y,940-2402,�����s�^���^��1623�Ԓn8,,H27.3.16,��,,��,,��,,,,,,,,��,,,,,,��,���̖@�l�́A�n��Ő�������V���o�[����̖L���Ȍo���Ɨ͂����p���A�܂��Â���C�x���g�̊��◢�R�������̊�����ʂ��āA���͂���n��Љ�̎����Ɋ�^���邱�Ƃ�ړI�Ƃ���B
�����c�������@�l�v���̂ق�,6110005015745 ,�����@����,949-5405,�����s���1649�Ԓn,,H27.3.16,,,��,��,��,,,,,,,,��,,,��,,,��,���̖@�l�͂��ׂĂ̒����s���ɑ΂��āA�����̒n�掑���ł���_�ƐH�̖��͂₻�̏d�v���̔��M�Ɋւ��鎖�Ƌy�сA�e��c�́A��Ɠ��Ƃ̘A�g��}�鎖�Ƃ��J�Â��A�X�ɂ͑��Y�ƂƊ֘A�������ƂŁA�_�ƐH�����������L�@�I�Ȓn��R�~���j�e�B�̎����ƒn��o�ς̊�������}��A�����̖L���Ȗ����̑n���Ɋ�^���邱�Ƃ�ړI�Ƃ��܂��B
�����c�������@�l�o���������������@�e���������������@�b������,2110005015823 ,���q�@�p��,940-0868,�����s�x��2����171�Ԓn1,,H27.10.19,��,��,,,,��,,,,,,,��,,,,,,��,���̖@�l�́A�����s�𒆐S�Ƃ���n��̗c�N�����珬�w���A���w���A���Z���A�Љ�l�ɑ΂��āA�T�b�J�[���͂��߂Ƃ���X�|�[�c�̐U���Ɋւ��鎖�Ƃ��s���A���U�X�|�[�c�Љ�̎����Ɋ�^���邱�Ƃ�ړI�Ƃ���B
�����c�������@�l�a�`�r����,8110005015859 ,�y�c�@�N��,940-0805,�����s�Y����4251�Ԓn,,H28.1.8,,��,��,,,,,,,,,,��,��,��,��,��,,��,���̖@�l�́A�N�������̂Â�����s�����Ƃ��ł���悤�Ȋ��𐮔����A��炵�̒��ɂ��̂Â��肪���Â��Љ�����邱�Ƃ�ړI�Ƃ���B
NPO�@�l�N�I���[�h,4110005015870 ,�N�g�@�a��,940-2034,�����s�㏜����1���ڍb1875�Ԓn12,,H28.2.3,��,��,��,,,,,,,,,,,,,,,,,���̖@�l�́A�Ⴊ�����E�ҋy�эL����ʎs���ɑ΂��āA���l�Ȋ����E�x���E�����y�ѕ����T�[�r�X�����̗��p�҂̈ӌ��𑸏d���đ����I�ɒ񋟂����悤�n�ӍH�v���邱�Ƃɂ�藘�p�ҋy�щƑ������l�̑�����ێ����A��������������n��Љ�ɉc�ނ��Ƃ��ł���悤�L���Z���̕����̑��i�Ɋ�^���邱�Ƃ�ړI�Ƃ���B
�����c�������@�l�o�������������������@�d�����������������@�������@�s�������������������@�����@�i��������,9110005015932 ,ABECIA�@�i�t�u�x�@ROMELA�@�e�k�n�q�d�r,940-0041,�����s�w�Z��2����14��21��,���C�I���Y�K�[�f������111����,H28.3.9,,,,,,��,,,,��,��,��,��,,,,��,,,���̖@�l�́A���{�����O�̃t�B���s���l�ɑ΂��A���ی𗬁E����x���Ȃǂ̎��Ƃ��s���A���{�ƃt�B���s���̕����E���番��ł̑��ݗ����̑��i�A���{�ɍݏZ����t�B���s���l�̎����I�Ō��₩�ȎЉ���̌���Ɋ�^���邱�Ƃ�ړI�Ƃ���B